{"text_format":"3","workbook":"xlsx","n_sheets":4,"sheets":["Einstellungen","Anmeldungen aus Markt-DB","Zeitfenster aller Lieferanten","Auffuhr-Zeitfenster"],"not_rendered":{"images":3,"macros":1,"defined_names":1},"read":"whole","date_system":"1900"}

{"sheet":"Einstellungen","index":0,"n_rows":11,"n_cols":9,"rows_kept":11,"hidden":true}
[]
[]
[]
[{"$nulls":7},"Einstellungen"]
[{"$nulls":7},"Start erstes Zeitfenster","06:30:00"]
[{"$nulls":7},"Zeitdauer pro Zeitfenster","00:45:00"]
[{"$nulls":7},"Maximalanzahl Tiere pro Zeitfenster",85]
[{"$nulls":7},"Mindestanzahl Tiere pro Betrieb für Vorrang",3]
[{"$nulls":7},"Marktort","Frutigen"]
[{"$nulls":7},"Marktdatum","12.03.2025"]
[{"$nulls":7},"Zeitfenster für Nachmeldungen","08:45 - 09:15"]

{"sheet":"Anmeldungen aus Markt-DB","index":1,"n_rows":172,"n_cols":18,"rows_kept":172,"hidden":true}
["TVD-Nr.","Vorname","Nachname","Strasse","PLZ","Ort","Anmeldetyp","Markt-Nr.","Markt-Name","Markt-Datum","MT - Muni ungeschaufelt","MA - Muni ältere","OB - Ochsen","RG - Rinder","RV - Jungkühe","VK - Kühe","JB - Jungvieh","Total angemeldete Tiere"]
[1424492,"Silas","Wyss","Hofstatt 3",3702,"Hondrich","Durch Anmeldestelle erfasste Anmeldungen",1428896,"Frutigen","2025-03-12T08:00:00",0,0,0,0,0,1,1,2]
[1425772,null,"Reichen Hansueli & Werner","Rotebüelweg 12",3704,"Krattigen","Durch Anmeldestelle erfasste Anmeldungen",1428896,"Frutigen","2025-03-12T08:00:00",0,0,0,0,0,0,2,2]
[1425871,"Philipp","Luginbühl","Chlostergasse 28",3704,"Krattigen","Durch Anmeldestelle erfasste Anmeldungen",1428896,"Frutigen","2025-03-12T08:00:00",0,0,0,0,0,0,3,3]
[1426526,"Thomas","Schmid","Heustrichstrasse 6",3711,"Emdthal","Anmeldungen (Einzel)",1428896,"Frutigen","2025-03-12T08:00:00",0,0,0,0,0,0,1,1]
[1426526,"Thomas","Schmid","Heustrichstrasse 6",3711,"Emdthal","Anmeldungen (Einzel)",1428896,"Frutigen","2025-03-12T08:00:00",0,0,0,0,0,0,1,1]
[1427905,"Karin","Wandfluh Willi","Burgweg 2",3714,"Frutigen","Durch Anmeldestelle erfasste Anmeldungen",1428896,"Frutigen","2025-03-12T08:00:00",0,0,0,0,0,0,2,2]
[1427943,"Andreas","Wäfler-Schüpbach","Adelbodenstrasse 18",3714,"Frutigen","Anmeldungen (Einzel)",1428896,"Frutigen","2025-03-12T08:00:00",0,1,0,0,0,0,0,1]
[1428032,"Albert jun.","Lörtscher","Sattlaweg 21",3714,"Frutigen","Anmeldungen (Einzel)",1428896,"Frutigen","2025-03-12T08:00:00",0,0,0,0,0,0,1,1]
[1428032,"Albert jun.","Lörtscher","Sattlaweg 21",3714,"Frutigen","Anmeldungen (Einzel)",1428896,"Frutigen","2025-03-12T08:00:00",0,0,0,0,0,0,1,1]
[1428049,"Willi","Inniger-Allenbach","Trummerliweg 5",3714,"Frutigen","Anmeldungen (Einzel)",1428896,"Frutigen","2025-03-12T08:00:00",0,0,0,0,0,0,1,1]
[1428049,"Willi","Inniger-Allenbach","Trummerliweg 5",3714,"Frutigen","Anmeldungen (Einzel)",1428896,"Frutigen","2025-03-12T08:00:00",0,0,0,0,0,0,1,1]
[1428056,"Verena","Held","Altenweg 4",3714,"Frutigen","Anmeldungen (Einzel)",1428896,"Frutigen","2025-03-12T08:00:00",0,0,0,0,0,0,1,1]
[1428056,"Verena","Held","Altenweg 4",3714,"Frutigen","Anmeldungen (Einzel)",1428896,"Frutigen","2025-03-12T08:00:00",0,0,0,0,0,0,1,1]
[1428063,"Daniel","Grossen","Truttenstrasse 2",3714,"Frutigen","Anmeldungen (Einzel)",1428896,"Frutigen","2025-03-12T08:00:00",0,0,0,0,0,0,1,1]
[1428063,"Daniel","Grossen","Truttenstrasse 2",3714,"Frutigen","Anmeldungen (Einzel)",1428896,"Frutigen","2025-03-12T08:00:00",0,0,0,0,0,0,1,1]
[1428063,"Daniel","Grossen","Truttenstrasse 2",3714,"Frutigen","Anmeldungen (Einzel)",1428896,"Frutigen","2025-03-12T08:00:00",0,0,0,0,0,1,0,1]
[1428292,"Christian","Hager","Prastenstrasse 33",3714,"Frutigen","Anmeldungen (Einzel)",1428896,"Frutigen","2025-03-12T08:00:00",1,0,0,0,0,0,0,1]
[1428315,"Andreas","Studer","Zinsmaadstrasse 13",3714,"Frutigen","Anmeldungen (Einzel)",1428896,"Frutigen","2025-03-12T08:00:00",0,0,0,0,0,0,1,1]
[1428452,"Hans","Zurbrügg-Schmid","Reinischstrasse 33",3714,"Frutigen","Durch Anmeldestelle erfasste Anmeldungen",1428896,"Frutigen","2025-03-12T08:00:00",0,0,0,2,0,1,0,3]
[1428704,"Reto","Schmid","Winkelstrasse 38",3714,"Frutigen","Anmeldungen (Einzel)",1428896,"Frutigen","2025-03-12T08:00:00",0,0,0,0,0,0,1,1]
[1428711,"Anton","Zurbrügg","Schützenweg 16",3714,"Frutigen","Anmeldungen (Einzel)",1428896,"Frutigen","2025-03-12T08:00:00",0,0,0,0,0,0,1,1]
[1428728,"Kilian","Lauber","Achern 38",3714,"Frutigen","Anmeldungen (Einzel)",1428896,"Frutigen","2025-03-12T08:00:00",0,0,0,0,0,0,1,1]
[1428728,"Kilian","Lauber","Achern 38",3714,"Frutigen","Anmeldungen (Einzel)",1428896,"Frutigen","2025-03-12T08:00:00",0,0,0,0,0,1,0,1]
[1428759,"Ernst","Grossen-Schmid","Renggstrasse 956",3723,"Kiental","Durch Anmeldestelle erfasste Anmeldungen",1428896,"Frutigen","2025-03-12T08:00:00",0,0,0,0,0,0,2,2]
[1428780,"Simon","Egger","Bodenweg 26",3714,"Frutigen","Durch Anmeldestelle erfasste Anmeldungen",1428896,"Frutigen","2025-03-12T08:00:00",0,0,0,0,0,1,0,1]
[1428797,null,"Studer Abraham & Beat","Schwendi 1",3714,"Frutigen","Durch Anmeldestelle erfasste Anmeldungen",1428896,"Frutigen","2025-03-12T08:00:00",0,0,0,0,0,0,4,4]
[1428919,"Beat","Trachsel","Zinsmaadstrasse 12",3714,"Frutigen","Durch Anmeldestelle erfasste Anmeldungen",1428896,"Frutigen","2025-03-12T08:00:00",0,0,0,0,0,0,1,1]
[1428971,"Alfred","Zurbrügg-Trummer","Schützenweg 14",3714,"Frutigen","Anmeldungen (Einzel)",1428896,"Frutigen","2025-03-12T08:00:00",0,0,0,0,0,0,1,1]
[1428971,"Alfred","Zurbrügg-Trummer","Schützenweg 14",3714,"Frutigen","Anmeldungen (Einzel)",1428896,"Frutigen","2025-03-12T08:00:00",0,0,0,0,0,0,1,1]
[1428988,"Daniel","Trachsel-Hänni","Spiezstrasse 11A",3714,"Frutigen","Anmeldungen (Einzel)",1428896,"Frutigen","2025-03-12T08:00:00",0,0,0,0,0,1,0,1]
[1429060,"Anton","Zürcher-Wäfler","Eggeweg 6",3714,"Frutigen","Anmeldungen (Einzel)",1428896,"Frutigen","2025-03-12T08:00:00",0,0,0,0,0,0,1,1]
[1429060,"Anton","Zürcher-Wäfler","Eggeweg 6",3714,"Frutigen","Anmeldungen (Einzel)",1428896,"Frutigen","2025-03-12T08:00:00",0,0,0,0,0,0,1,1]
[1429121,"Hansrudolf","Bütschi-Zurbuchen","Wallisgasse 11",3714,"Frutigen","Anmeldungen (Einzel)",1428896,"Frutigen","2025-03-12T08:00:00",0,0,0,0,0,1,0,1]
[1429145,"Kurt","Burn","Achern 13",3714,"Frutigen","Anmeldungen (Einzel)",1428896,"Frutigen","2025-03-12T08:00:00",0,0,0,0,0,0,1,1]
[1429213,null,"Grossen Hans & Eduard","Loostrasse 5",3714,"Frutigen","Durch Anmeldestelle erfasste Anmeldungen",1428896,"Frutigen","2025-03-12T08:00:00",0,1,0,0,0,0,3,4]
[1429237,"Martin","Schneider","Gsang  2",3714,"Frutigen","Durch Anmeldestelle erfasste Anmeldungen",1428896,"Frutigen","2025-03-12T08:00:00",0,0,0,0,0,0,2,2]
[1429572,"Hans","Hari-Grossen","Adelgos 8",3714,"Frutigen","Durch Anmeldestelle erfasste Anmeldungen",1428896,"Frutigen","2025-03-12T08:00:00",0,0,0,0,0,0,2,2]
[1429640,"Rudolf","Brügger","Zum Tanzplatz 1",3714,"Frutigen","Anmeldungen (Einzel)",1428896,"Frutigen","2025-03-12T08:00:00",0,0,0,0,0,0,1,1]
[1429640,"Rudolf","Brügger","Zum Tanzplatz 1",3714,"Frutigen","Anmeldungen (Einzel)",1428896,"Frutigen","2025-03-12T08:00:00",0,0,0,0,0,0,1,1]
[1429640,"Rudolf","Brügger","Zum Tanzplatz 1",3714,"Frutigen","Anmeldungen (Einzel)",1428896,"Frutigen","2025-03-12T08:00:00",0,0,0,0,0,0,1,1]
[1429640,"Rudolf","Brügger","Zum Tanzplatz 1",3714,"Frutigen","Anmeldungen (Einzel)",1428896,"Frutigen","2025-03-12T08:00:00",0,0,0,0,1,0,0,1]
[1429640,"Andreas","Brügger","Wurmerenstrasse 2",3713,"Reichenbach im Kandertal","Anmeldungen (Einzel)",1428896,"Frutigen","2025-03-12T08:00:00",0,0,0,0,0,0,1,1]
[1429640,"Andreas","Brügger","Wurmerenstrasse 2",3713,"Reichenbach im Kandertal","Anmeldungen (Einzel)",1428896,"Frutigen","2025-03-12T08:00:00",0,0,0,0,0,0,1,1]
[1429640,null,"Brügger Rudolf & Andreas","Zum Tanzplatz 1",3714,"Frutigen","Durch Anmeldestelle erfasste Anmeldungen",1428896,"Frutigen","2025-03-12T08:00:00",0,0,0,1,0,0,0,1]
[1429671,"Anton","Hager","Adelgos 6",3714,"Frutigen","Durch Anmeldestelle erfasste Anmeldungen",1428896,"Frutigen","2025-03-12T08:00:00",0,0,0,0,0,1,3,4]
[1429688,"Sonja","Bircher-Büschlen","Altenweg 17",3714,"Frutigen","Anmeldungen (Einzel)",1428896,"Frutigen","2025-03-12T08:00:00",0,0,0,0,0,0,1,1]
[1429756,"Hans","Jungen-Reichen","Reinischstrasse 16",3714,"Frutigen","Durch Anmeldestelle erfasste Anmeldungen",1428896,"Frutigen","2025-03-12T08:00:00",0,0,0,0,0,1,0,1]
[1429787,"Leo","Wyssen","Adelbodenstrasse 45",3714,"Frutigen","Anmeldungen (Einzel)",1428896,"Frutigen","2025-03-12T08:00:00",0,0,0,0,0,0,1,1]
[1429817,"Therese","Steiner-Lanz","Wallisgasse 30",3714,"Frutigen","Durch Anmeldestelle erfasste Anmeldungen",1428896,"Frutigen","2025-03-12T08:00:00",0,0,0,0,0,0,3,3]
[1429855,"Armin","Steuri-Wäfler","Hauptstrasse 180",3714,"Wengi b. Frutigen","Anmeldungen (Einzel)",1428896,"Frutigen","2025-03-12T08:00:00",0,0,0,0,0,0,1,1]
[1429855,"Armin","Steuri-Wäfler","Hauptstrasse 180",3714,"Wengi b. Frutigen","Anmeldungen (Einzel)",1428896,"Frutigen","2025-03-12T08:00:00",0,0,0,0,0,1,0,1]
[1430042,"Samuel","Oester","Stiegelschwandstrasse 80",3715,"Adelboden","Anmeldungen (Einzel)",1428896,"Frutigen","2025-03-12T08:00:00",0,0,0,0,0,0,1,1]
[1430042,"Samuel","Oester","Stiegelschwandstrasse 80",3715,"Adelboden","Anmeldungen (Einzel)",1428896,"Frutigen","2025-03-12T08:00:00",0,0,0,0,0,0,1,1]
[1430042,"Samuel","Oester","Stiegelschwandstrasse 80",3715,"Adelboden","Anmeldungen (Einzel)",1428896,"Frutigen","2025-03-12T08:00:00",0,0,0,0,0,0,1,1]
[1430301,"Ueli","Grossen-Hari","oberes Hirzboden 2",3715,"Adelboden","Durch Anmeldestelle erfasste Anmeldungen",1428896,"Frutigen","2025-03-12T08:00:00",0,0,0,0,0,0,1,1]
[1430424,"Toni","Germann","Stiegelschwandstrasse 88",3715,"Adelboden","Anmeldungen (Einzel)",1428896,"Frutigen","2025-03-12T08:00:00",1,0,0,0,0,0,0,1]
[1430424,"Toni","Germann","Stiegelschwandstrasse 88",3715,"Adelboden","Anmeldungen (Einzel)",1428896,"Frutigen","2025-03-12T08:00:00",1,0,0,0,0,0,0,1]
[1430424,"Toni","Germann","Stiegelschwandstrasse 88",3715,"Adelboden","Anmeldungen (Einzel)",1428896,"Frutigen","2025-03-12T08:00:00",1,0,0,0,0,0,0,1]
[1430462,"Christian","Fuhrer","Engstligenstrasse 5",3715,"Adelboden","Anmeldungen (Einzel)",1428896,"Frutigen","2025-03-12T08:00:00",0,0,0,0,0,0,1,1]
[1430462,"Christian","Fuhrer","Engstligenstrasse 5",3715,"Adelboden","Anmeldungen (Einzel)",1428896,"Frutigen","2025-03-12T08:00:00",0,0,0,0,0,0,1,1]
[1430479,"Abraham jun.","Germann","Engstligenstrasse 37",3715,"Adelboden","Anmeldungen (Einzel)",1428896,"Frutigen","2025-03-12T08:00:00",0,0,0,0,0,0,1,1]
[1430479,"Abraham jun.","Germann","Engstligenstrasse 37",3715,"Adelboden","Anmeldungen (Einzel)",1428896,"Frutigen","2025-03-12T08:00:00",0,0,0,0,0,0,1,1]
[1430547,"Anton","Hari","Hahnenmoosstrasse 15",3715,"Adelboden","Anmeldungen (Einzel)",1428896,"Frutigen","2025-03-12T08:00:00",0,0,0,0,0,0,1,1]
[1430547,"Anton","Hari","Hahnenmoosstrasse 15",3715,"Adelboden","Anmeldungen (Einzel)",1428896,"Frutigen","2025-03-12T08:00:00",0,0,0,0,0,0,1,1]
[1430547,"Anton","Hari","Hahnenmoosstrasse 15",3715,"Adelboden","Anmeldungen (Einzel)",1428896,"Frutigen","2025-03-12T08:00:00",0,0,0,0,0,0,1,1]
[1430561,"Christian","Zurbrügg-Schläppi","Oberes Hirzboden 13",3715,"Adelboden","Durch Anmeldestelle erfasste Anmeldungen",1428896,"Frutigen","2025-03-12T08:00:00",0,0,0,0,0,0,1,1]
[1430608,"Marco","Hari","Alte Strasse 53",3715,"Adelboden","Anmeldungen (Einzel)",1428896,"Frutigen","2025-03-12T08:00:00",0,0,0,0,0,0,1,1]
[1430608,"Marco","Hari","Alte Strasse 53",3715,"Adelboden","Anmeldungen (Einzel)",1428896,"Frutigen","2025-03-12T08:00:00",0,0,0,0,0,0,1,1]
[1430639,"Werner","Büschlen-Fuhrer","Stiegelschwandstrasse 25",3715,"Adelboden","Durch Anmeldestelle erfasste Anmeldungen",1428896,"Frutigen","2025-03-12T08:00:00",0,0,0,0,0,0,2,2]
[1430660,"Fritz","Büschlen-Hirschi","Hirzbodenportstrasse 1",3715,"Adelboden","Durch Anmeldestelle erfasste Anmeldungen",1428896,"Frutigen","2025-03-12T08:00:00",0,0,0,0,0,0,1,1]
[1430691,"Christian","Schranz","Bollerstrasse 3",3715,"Adelboden","Anmeldungen (Einzel)",1428896,"Frutigen","2025-03-12T08:00:00",0,0,0,0,0,0,1,1]
[1430691,"Christian","Schranz","Bollerstrasse 3",3715,"Adelboden","Anmeldungen (Einzel)",1428896,"Frutigen","2025-03-12T08:00:00",0,0,0,0,0,0,1,1]
[1430707,"Albin","Allenbach-Beer","Hohliebeweg 24",3715,"Adelboden","Durch Anmeldestelle erfasste Anmeldungen",1428896,"Frutigen","2025-03-12T08:00:00",0,0,0,0,0,0,2,2]
[1430783,"Jovin","Strässler","Kuonisbärgliweg 23",3715,"Adelboden","Anmeldungen (Einzel)",1428896,"Frutigen","2025-03-12T08:00:00",1,0,0,0,0,0,0,1]
[1430783,"Jovin","Strässler","Kuonisbärgliweg 23",3715,"Adelboden","Anmeldungen (Einzel)",1428896,"Frutigen","2025-03-12T08:00:00",1,0,0,0,0,0,0,1]
[1430868,"Simon","Bircher","Alte Strasse 34",3715,"Adelboden","Anmeldungen (Einzel)",1428896,"Frutigen","2025-03-12T08:00:00",0,0,0,0,0,0,1,1]
[1430912,"Friedrich","Schranz","Brüggenweg 6",3715,"Adelboden","Anmeldungen (Einzel)",1428896,"Frutigen","2025-03-12T08:00:00",0,0,0,0,0,0,1,1]
[1431094,"Konrad","Lauber","Eselmoosgasse 25",3715,"Adelboden","Anmeldungen (Einzel)",1428896,"Frutigen","2025-03-12T08:00:00",0,0,0,0,0,0,1,1]
[1431094,"Konrad","Lauber","Eselmoosgasse 25",3715,"Adelboden","Anmeldungen (Einzel)",1428896,"Frutigen","2025-03-12T08:00:00",0,0,0,0,0,0,1,1]
{"$rows_left_out":93}
{"sheet":"Zeitfenster aller Lieferanten","index":2,"n_rows":112,"n_cols":9,"rows_kept":112,"hidden":true}
["TVD-Nr.","Vorname","Nachname","Strasse","PLZ","Ort","Angemeldetete Tiere","Auffuhr-Reihenfolge","Zeitfenster"]
[1434415,"Peter","Marmet-Ritter","Rinderwaldstrasse 55",3725,"Achseten",3,1,"06:30 - 07:15"]
[1429817,"Therese","Steiner-Lanz","Wallisgasse 30",3714,"Frutigen",3,2,"06:30 - 07:15"]
[1428797,null,"Studer Abraham & Beat","Schwendi 1",3714,"Frutigen",4,3,"06:30 - 07:15"]
[1428452,"Hans","Zurbrügg-Schmid","Reinischstrasse 33",3714,"Frutigen",3,4,"06:30 - 07:15"]
[1434521,"Gottlieb","Bircher-Inniger","Bächenstrasse 1",3725,"Achseten",6,5,"06:30 - 07:15"]
[1430424,"Toni","Germann","Stiegelschwandstrasse 88",3715,"Adelboden",3,6,"06:30 - 07:15"]
[1429640,null,"Brügger Rudolf & Andreas","Zum Tanzplatz 1",3714,"Frutigen",7,7,"06:30 - 07:15"]
[1434408,"Theodor","Bircher-Marmet","Hintereggstrasse 1",3725,"Achseten",3,8,"06:30 - 07:15"]
[1434705,null,"Schmid Peter & Werner","Ladholzstrasse 13",3725,"Achseten",4,9,"06:30 - 07:15"]
[1434804,"Melchior","Marmet","Metschstrasse 8",3725,"Achseten",3,10,"06:30 - 07:15"]
[1432343,"Peter","Lauber","Ausserkandergrund 69c",3716,"Kandergrund",4,11,"06:30 - 07:15"]
[1429671,"Anton","Hager","Adelgos 6",3714,"Frutigen",4,12,"06:30 - 07:15"]
[1425871,"Philipp","Luginbühl","Chlostergasse 28",3704,"Krattigen",3,13,"06:30 - 07:15"]
[1434583,"Jakob","Allenbach","Alte Adelbodenstrasse 12",3725,"Achseten",3,14,"06:30 - 07:15"]
[1429213,null,"Grossen Hans & Eduard","Loostrasse 5",3714,"Frutigen",4,15,"06:30 - 07:15"]
[1857184,"Dora","Wyssen-Trachsel","Riedstrasse 54C",3724,"Ried (Frutigen)",3,16,"06:30 - 07:15"]
[1428063,"Daniel","Grossen","Truttenstrasse 2",3714,"Frutigen",3,17,"06:30 - 07:15"]
[1430042,"Samuel","Oester","Stiegelschwandstrasse 80",3715,"Adelboden",3,18,"06:30 - 07:15"]
[1430547,"Anton","Hari","Hahnenmoosstrasse 15",3715,"Adelboden",3,19,"06:30 - 07:15"]
[1435016,"Alfred","Jungen-Hofer","Reinischstrasse 37",3714,"Frutigen",1,20,"06:30 - 07:15"]
[1434996,"David","Reichen-Marmet","Labrunnenstrasse 6",3725,"Achseten",1,21,"06:30 - 07:15"]
[1431148,"Samuel","Inniger","Laserweg  8",3715,"Adelboden",2,22,"06:30 - 07:15"]
[1433302,"Ernst","Müller-Wäfler","Lindenmatte 4",3722,"Scharnachtal",2,23,"06:30 - 07:15"]
[1434033,"Simon Rudolf","Stoller","Riedstrasse 13",3724,"Ried (Frutigen)",2,24,"06:30 - 07:15"]
[1430783,"Jovin","Strässler","Kuonisbärgliweg 23",3715,"Adelboden",2,25,"06:30 - 07:15"]
[1431551,"Peter","Schranz-Trachsel","Oberes Hirzboden 12",3715,"Adelboden",1,26,"06:30 - 07:15"]
[1477665,"Paul","Mosimann","Alte Frutigenstrasse 21",3711,"Mülenen",1,27,"06:30 - 07:15"]
[1434514,"Samuel","Marmet","Kalleneggstrasse 1",3725,"Achseten",1,28,"06:30 - 07:15"]
[1428988,"Daniel","Trachsel-Hänni","Spiezstrasse 11A",3714,"Frutigen",1,29,"06:30 - 07:15"]
[1430691,"Christian","Schranz","Bollerstrasse 3",3715,"Adelboden",2,30,"06:30 - 07:15"]
[1431131,"David","Germann-Steiner","Egernschwandweg 4",3715,"Adelboden",2,31,"07:15 - 08:00"]
[1430868,"Simon","Bircher","Alte Strasse 34",3715,"Adelboden",1,32,"07:15 - 08:00"]
[1430639,"Werner","Büschlen-Fuhrer","Stiegelschwandstrasse 25",3715,"Adelboden",2,33,"07:15 - 08:00"]
[1431490,"Peter","Bircher-Mazenauer","Neuweg 26",3715,"Adelboden",2,34,"07:15 - 08:00"]
[1428292,"Christian","Hager","Prastenstrasse 33",3714,"Frutigen",1,35,"07:15 - 08:00"]
[1429855,"Armin","Steuri-Wäfler","Hauptstrasse 180",3714,"Wengi b. Frutigen",2,36,"07:15 - 08:00"]
[1434286,"Urs","Wäfler","Rinderwaldstrasse 6",3725,"Achseten",2,37,"07:15 - 08:00"]
[1434736,"Andre","Inniger","Alte Adelbodenstrasse 36",3725,"Achseten",1,38,"07:15 - 08:00"]
[1435054,"Niklaus","Ast","Unterdorfstrasse 2",3752,"Wimmis",2,39,"07:15 - 08:00"]
[1429756,"Hans","Jungen-Reichen","Reinischstrasse 16",3714,"Frutigen",1,40,"07:15 - 08:00"]
[1434385,"Samuel","Zahler","Rinderwaldstrasse 31",3725,"Achseten",1,41,"07:15 - 08:00"]
[1433906,"Sonja","Inniger-Trachsel","Gempelen 1",3724,"Ried (Frutigen)",2,42,"07:15 - 08:00"]
[1431902,"Kilian","Bircher","Oberer Hirzboden 5",3715,"Adelboden",1,43,"07:15 - 08:00"]
[1433838,"Severin","Wyssen","Gempelen 6",3724,"Ried (Frutigen)",2,44,"07:15 - 08:00"]
[1434194,"Peter","Trummer","Riedstrasse 23",3724,"Ried (Frutigen)",1,45,"07:15 - 08:00"]
[1430912,"Friedrich","Schranz","Brüggenweg 6",3715,"Adelboden",1,46,"07:15 - 08:00"]
[1430462,"Christian","Fuhrer","Engstligenstrasse 5",3715,"Adelboden",2,47,"07:15 - 08:00"]
[1430301,"Ueli","Grossen-Hari","oberes Hirzboden 2",3715,"Adelboden",1,48,"07:15 - 08:00"]
[1431759,"Stephan","Sarbach-Büschlen","alte Strasse 39",3715,"Adelboden",1,49,"07:15 - 08:00"]
[1434354,"Andres","Bircher-Marmet","Hintereggstrasse 8",3725,"Achseten",2,50,"07:15 - 08:00"]
[1431889,"Hanspeter","Inniger-Allenbach","Alte Strasse 52",3715,"Adelboden",1,51,"07:15 - 08:00"]
[1434637,"Pirmin","Lauber","Rinderwaldstrasse 37",3725,"Achseten",1,52,"07:15 - 08:00"]
[1428315,"Andreas","Studer","Zinsmaadstrasse 13",3714,"Frutigen",1,53,"07:15 - 08:00"]
[1430660,"Fritz","Büschlen-Hirschi","Hirzbodenportstrasse 1",3715,"Adelboden",1,54,"07:15 - 08:00"]
[1431353,"Johann","Allenbach","Engstligenstrasse 45",3715,"Adelboden",1,55,"07:15 - 08:00"]
[1434491,"Fritz","Reichen-Brosi","Rinderwaldstrasse 14",3725,"Achseten",1,56,"07:15 - 08:00"]
[1431957,"Werner","Inniger-Kropf","Alte Strasse 51",3715,"Adelboden",2,57,"07:15 - 08:00"]
[1432251,"Ruedi","Wandfluh","Engibrücke 67",3716,"Kandergrund",1,58,"07:15 - 08:00"]
[1430561,"Christian","Zurbrügg-Schläppi","Oberes Hirzboden 13",3715,"Adelboden",1,59,"07:15 - 08:00"]
[1434682,"Hansrudolf","Wyssen","Rinderwaldstrasse 26",3725,"Achseten",1,60,"07:15 - 08:00"]
[1431476,"Anton","Schranz-Lauber","Gassi 1",3715,"Adelboden",1,61,"07:15 - 08:00"]
[1431704,"Andreas","Inniger-Gehret","Alte Strasse 56",3715,"Adelboden",2,62,"07:15 - 08:00"]
[1430707,"Albin","Allenbach-Beer","Hohliebeweg 24",3715,"Adelboden",2,63,"07:15 - 08:00"]
[1430608,"Marco","Hari","Alte Strasse 53",3715,"Adelboden",2,64,"07:15 - 08:00"]
[1429060,"Anton","Zürcher-Wäfler","Eggeweg 6",3714,"Frutigen",2,65,"07:15 - 08:00"]
[1429688,"Sonja","Bircher-Büschlen","Altenweg 17",3714,"Frutigen",1,66,"07:15 - 08:00"]
[1428759,"Ernst","Grossen-Schmid","Renggstrasse 956",3723,"Kiental",2,67,"07:15 - 08:00"]
[1428728,"Kilian","Lauber","Achern 38",3714,"Frutigen",2,68,"07:15 - 08:00"]
[1434064,"Alfred","Inniger-Trachsel","Linterstrasse 16",3724,"Ried (Frutigen)",2,69,"07:15 - 08:00"]
[1429145,"Kurt","Burn","Achern 13",3714,"Frutigen",1,70,"07:15 - 08:00"]
[1429237,"Martin","Schneider","Gsang  2",3714,"Frutigen",2,71,"07:15 - 08:00"]
[1431438,"Hansjonas","Oester-Schranz","Stiegelschwandstrasse 12",3715,"Adelboden",1,72,"07:15 - 08:00"]
[1428971,"Alfred","Zurbrügg-Trummer","Schützenweg 14",3714,"Frutigen",2,73,"07:15 - 08:00"]
[1428704,"Reto","Schmid","Winkelstrasse 38",3714,"Frutigen",1,74,"07:15 - 08:00"]
[1432350,"Peter","Wandfluh","Petersmattli 68",3716,"Kandergrund",2,75,"07:15 - 08:00"]
[1429572,"Hans","Hari-Grossen","Adelgos 8",3714,"Frutigen",2,76,"07:15 - 08:00"]
[1431414,"Peter","Grossen-Hari","Kuonisbergliweg 3",3715,"Adelboden",2,77,"07:15 - 08:00"]
[1425772,null,"Reichen Hansueli & Werner","Rotebüelweg 12",3704,"Krattigen",2,78,"07:15 - 08:00"]
[1426526,"Thomas","Schmid","Heustrichstrasse 6",3711,"Emdthal",2,79,"07:15 - 08:00"]
{"$rows_left_out":33}
{"sheet":"Auffuhr-Zeitfenster","index":3,"n_rows":21,"n_cols":5,"rows_kept":21}
[]
[]
[null,null,{"$f":"\"Schlachtviehmarkt \" & Einstellungen!$I$9 & \" vom \" & TEXT(Einstellungen!$I$10,\"TT.MM.JJJJ\")","v":"Schlachtviehmarkt Frutigen vom 12.03.2025"}]
[]
[]
[]
[null,null,"TVD-Nr.:",null,"Bewilligtes Auffuhr-Zeitfenster:"]
[{"$nulls":4},{"$f":"IF(C8=\"\",\"Bitte geben Sie Ihre TVD-Nr. ein.\",IF(ISNA(VLOOKUP(C8,'Zeitfenster aller Lieferanten'!$A:$I,3,FALSE)),\"Für diese TVD-Nummer sind keine Tiere angemeldet.\",VLOOKUP(C8,'Zeitfenster aller Lieferanten'!$A:$I,3,FALSE) & \" \" & VLOOKUP(C8,'Zeitfenster aller Lieferanten'!$A:$I,2,FALSE) & \", Angemeldete Tiere: \" & VLOOKUP(C8,'Zeitfenster aller Lieferanten'!$A:$I,7,FALSE)& \", Zeitfenster: \" & VLOOKUP(C8,'Zeitfenster aller Lieferanten'!$A:$I,9,FALSE)))","v":"Bitte geben Sie Ihre TVD-Nr. ein."}]
[]
[]
[null,null,{"$f":"\"Nachgemeldete Tiere müssen im Auffuhr-Zeitfenster \" &Einstellungen!I11 & \" aufgeführt werden.\"","v":"Nachgemeldete Tiere müssen im Auffuhr-Zeitfenster 08:45 - 09:15 aufgeführt werden."}]
[]
[null,null,"Wichtig:"]
[null,null,"Brief ausdrucken oder fotografieren - Auffuhrzeit muss vorgewiesen werden."]
[null,null,"Bewirtschafter ohne Kennzeichnung werden auf dem Marktplatz zurückgewiesen."]
[]
[null,null,"Die Auffuhr erfolgt gestaffelt auf dem Flugplatz Frutigen. "]
[null,null,"Sie erhalten vom Sicherheitsdienst eine Kennzeichnung und werden anschliessend zum Ausladen auf dem Marktplatz aufgefordert."]
[null,null,"Ihr Fahrzeug muss auf den Flugplatz zurückgebracht werden, bevor Sie Ihr/e Tier/e ausmerzen. "]
[null,null,"Für die Retourfahrt zur Markthalle steht Ihnen der Shuttlebus zur Verfügung. "]
[null,null,"Sie können nach dem Abrechnen im Restaurant Kreuz ebenfalls ab Marktplatz vom Shuttlebus Gebrauch machen."]